Page MenuHomeSoftware Heritage

package.json: Upgrade dependencies
ClosedPublic

Authored by anlambert on Wed, Jan 5, 11:29 AM.

Details

Summary

Testing the build on Jenkins as I got some failures after package upgrades yersteday.

Diff Detail

Repository
rDWAPPS Web applications
Lint
Automatic diff as part of commit; lint not applicable.
Unit
Automatic diff as part of commit; unit tests not applicable.

Event Timeline

Build has FAILED

Patch application report for D6877 (id=24937)

Rebasing onto 4e303b96ae...

Current branch diff-target is up to date.
Changes applied before test
commit a3cb1383a90ec95020d61c37988067cfb014ac95
Author: Antoine Lambert <anlambert@softwareheritage.org>
Date:   Wed Jan 5 11:28:19 2022 +0100

    package.json: Upgrade dependencies

Link to build: https://jenkins.softwareheritage.org/job/DWAPPS/job/tests-on-diff/1273/
See console output for more information: https://jenkins.softwareheritage.org/job/DWAPPS/job/tests-on-diff/1273/console

Harbormaster returned this revision to the author for changes because remote builds failed.Wed, Jan 5, 11:35 AM
Harbormaster failed remote builds in B25808: Diff 24937!

Try to workaround webpack resolving issues for core-js.

Build has FAILED

Patch application report for D6877 (id=24938)

Rebasing onto 4e303b96ae...

Current branch diff-target is up to date.
Changes applied before test
commit 74859cfd6c482732b319fefbfa66b9a2822fc965
Author: Antoine Lambert <anlambert@softwareheritage.org>
Date:   Wed Jan 5 11:28:19 2022 +0100

    package.json: Upgrade dependencies

Link to build: https://jenkins.softwareheritage.org/job/DWAPPS/job/tests-on-diff/1274/
See console output for more information: https://jenkins.softwareheritage.org/job/DWAPPS/job/tests-on-diff/1274/console

Harbormaster returned this revision to the author for changes because remote builds failed.Wed, Jan 5, 11:51 AM
Harbormaster failed remote builds in B25809: Diff 24938!

Build is green

Patch application report for D6877 (id=24939)

Rebasing onto 4e303b96ae...

Current branch diff-target is up to date.
Changes applied before test
commit a39f6dfec5c9e32226ec3258b5ad58eed6ae107f
Author: Antoine Lambert <anlambert@softwareheritage.org>
Date:   Wed Jan 5 11:28:19 2022 +0100

    package.json: Upgrade dependencies

See https://jenkins.softwareheritage.org/job/DWAPPS/job/tests-on-diff/1275/ for more details.

Check if core-js 3.20 introduces build failure.

Build is green

Patch application report for D6877 (id=24941)

Rebasing onto 4e303b96ae...

Current branch diff-target is up to date.
Changes applied before test
commit 2bfb5804c375ccbb604712a0c0242d87c66f58c6
Author: Antoine Lambert <anlambert@softwareheritage.org>
Date:   Wed Jan 5 11:28:19 2022 +0100

    package.json: Upgrade dependencies

See https://jenkins.softwareheritage.org/job/DWAPPS/job/tests-on-diff/1276/ for more details.

core-js 3.20 OK, bump to 3.20.1

core-js 3.20.1 OK, bump to 3.20.2

Build has FAILED

Patch application report for D6877 (id=24944)

Rebasing onto 4e303b96ae...

Current branch diff-target is up to date.
Changes applied before test
commit 505eb03c2683d78801cd60bd1eb385d6e26ae3f4
Author: Antoine Lambert <anlambert@softwareheritage.org>
Date:   Wed Jan 5 11:28:19 2022 +0100

    package.json: Upgrade dependencies

Link to build: https://jenkins.softwareheritage.org/job/DWAPPS/job/tests-on-diff/1278/
See console output for more information: https://jenkins.softwareheritage.org/job/DWAPPS/job/tests-on-diff/1278/console

Build is green

Patch application report for D6877 (id=24942)

Rebasing onto 4e303b96ae...

Current branch diff-target is up to date.
Changes applied before test
commit 3fd45a4c80e858a4286323614f478b7958a20b4d
Author: Antoine Lambert <anlambert@softwareheritage.org>
Date:   Wed Jan 5 11:28:19 2022 +0100

    package.json: Upgrade dependencies

See https://jenkins.softwareheritage.org/job/DWAPPS/job/tests-on-diff/1277/ for more details.

Pin core-js to 3.20.1 and deduplicate entries in yarn.lock

Build is green

Patch application report for D6877 (id=24945)

Rebasing onto 4e303b96ae...

Current branch diff-target is up to date.
Changes applied before test
commit b68b37df41414f864c943aeb159ef8995ca6d6ae
Author: Antoine Lambert <anlambert@softwareheritage.org>
Date:   Wed Jan 5 11:28:19 2022 +0100

    package.json: Upgrade dependencies

See https://jenkins.softwareheritage.org/job/DWAPPS/job/tests-on-diff/1279/ for more details.

This revision was not accepted when it landed; it landed in state Needs Review.Wed, Jan 5, 1:53 PM
This revision was automatically updated to reflect the committed changes.