Page MenuHomeSoftware Heritage

Build 1085

Lint

When
Completed at Mar 21 2017, 3:48 PM · Built for 14 s
Status
Failed

Build Log 3638 (remote - stderr)
25 - 50 - 100 - Unlimited Lines

1make: *** [check] Error 1
2

Build Log 3637 (remote - stdout)
25 - 50 - 100 - Unlimited Lines

1python3 -m flake8 swh bin/swh-storage-add-dir
2swh/storage/vault/cookers/revision_git.py:149:18: W503 line break before binary operator
3swh/storage/vault/cookers/revision_git.py:150:18: W503 line break before binary operator
4../Makefile.python:25: recipe for target 'check' failed
5

Python tests

When
Completed at Mar 21 2017, 3:48 PM · Built for 6 s
Status
Failed
1 empty logs are hidden. Show all logs.

Build Log 3636 (remote - stderr)
25 - 50 - 100 - Unlimited Lines

65 File "/home/temp-drydock/drydock/workingcopy-169/repo/swh-model/swh/model/hashutil.py", line 48, in <module>
66 import pyblake2
67ImportError: No module named 'pyblake2'
68
69======================================================================
70ERROR: Failure: ImportError (No module named 'pyblake2')
71----------------------------------------------------------------------
72Traceback (most recent call last):
73 File "/usr/lib/python3/dist-packages/nose/failure.py", line 39, in runTest
74 raise self.exc_val.with_traceback(self.tb)
75 File "/usr/lib/python3/dist-packages/nose/loader.py", line 414, in loadTestsFromName
76 addr.filename, addr.module)
77 File "/usr/lib/python3/dist-packages/nose/importer.py", line 47, in importFromPath
78 return self.importFromDir(dir_path, fqname)
79 File "/usr/lib/python3/dist-packages/nose/importer.py", line 94, in importFromDir
80 mod = load_module(part_fqname, fh, filename, desc)
81 File "/usr/lib/python3.4/imp.py", line 235, in load_module
82 return load_source(name, filename, file)
83 File "/usr/lib/python3.4/imp.py", line 171, in load_source
84 module = methods.load()
85 File "<frozen importlib._bootstrap>", line 1220, in load
86 File "<frozen importlib._bootstrap>", line 1200, in _load_unlocked
87 File "<frozen importlib._bootstrap>", line 1129, in _exec
88 File "<frozen importlib._bootstrap>", line 1471, in exec_module
89 File "<frozen importlib._bootstrap>", line 321, in _call_with_frames_removed
90 File "/home/temp-drydock/drydock/workingcopy-169/repo/swh-storage/swh/storage/tests/test_converters.py", line 11, in <module>
91 from swh.storage import converters
92 File "/home/temp-drydock/drydock/workingcopy-169/repo/swh-storage/swh/storage/__init__.py", line 6, in <module>
93 from . import storage
94 File "/home/temp-drydock/drydock/workingcopy-169/repo/swh-storage/swh/storage/storage.py", line 13, in <module>
95 from . import converters
96 File "/home/temp-drydock/drydock/workingcopy-169/repo/swh-storage/swh/storage/converters.py", line 9, in <module>
97 from swh.model import identifiers
98 File "/home/temp-drydock/drydock/workingcopy-169/repo/swh-model/swh/model/identifiers.py", line 10, in <module>
99 from .hashutil import hash_data, hash_git_data
100 File "/home/temp-drydock/drydock/workingcopy-169/repo/swh-model/swh/model/hashutil.py", line 48, in <module>
101 import pyblake2
102ImportError: No module named 'pyblake2'
103
104======================================================================
105ERROR: Failure: ImportError (No module named 'pyblake2')
106----------------------------------------------------------------------
107Traceback (most recent call last):
108 File "/usr/lib/python3/dist-packages/nose/failure.py", line 39, in runTest
109 raise self.exc_val.with_traceback(self.tb)
110 File "/usr/lib/python3/dist-packages/nose/loader.py", line 414, in loadTestsFromName
111 addr.filename, addr.module)
112 File "/usr/lib/python3/dist-packages/nose/importer.py", line 47, in importFromPath
113 return self.importFromDir(dir_path, fqname)
114 File "/usr/lib/python3/dist-packages/nose/importer.py", line 94, in importFromDir
115 mod = load_module(part_fqname, fh, filename, desc)
116 File "/usr/lib/python3.4/imp.py", line 235, in load_module
117 return load_source(name, filename, file)
118 File "/usr/lib/python3.4/imp.py", line 171, in load_source
119 module = methods.load()
120 File "<frozen importlib._bootstrap>", line 1220, in load
121 File "<frozen importlib._bootstrap>", line 1200, in _load_unlocked
122 File "<frozen importlib._bootstrap>", line 1129, in _exec
123 File "<frozen importlib._bootstrap>", line 1471, in exec_module
124 File "<frozen importlib._bootstrap>", line 321, in _call_with_frames_removed
125 File "/home/temp-drydock/drydock/workingcopy-169/repo/swh-storage/swh/storage/tests/test_db.py", line 13, in <module>
126 from swh.model.hashutil import hash_to_bytes
127 File "/home/temp-drydock/drydock/workingcopy-169/repo/swh-model/swh/model/hashutil.py", line 48, in <module>
128 import pyblake2
129ImportError: No module named 'pyblake2'
130
131======================================================================
132ERROR: Failure: ImportError (No module named 'pyblake2')
133----------------------------------------------------------------------
134Traceback (most recent call last):
135 File "/usr/lib/python3/dist-packages/nose/failure.py", line 39, in runTest
136 raise self.exc_val.with_traceback(self.tb)
137 File "/usr/lib/python3/dist-packages/nose/loader.py", line 414, in loadTestsFromName
138 addr.filename, addr.module)
139 File "/usr/lib/python3/dist-packages/nose/importer.py", line 47, in importFromPath
140 return self.importFromDir(dir_path, fqname)
141 File "/usr/lib/python3/dist-packages/nose/importer.py", line 94, in importFromDir
142 mod = load_module(part_fqname, fh, filename, desc)
143 File "/usr/lib/python3.4/imp.py", line 235, in load_module
144 return load_source(name, filename, file)
145 File "/usr/lib/python3.4/imp.py", line 171, in load_source
146 module = methods.load()
147 File "<frozen importlib._bootstrap>", line 1220, in load
148 File "<frozen importlib._bootstrap>", line 1200, in _load_unlocked
149 File "<frozen importlib._bootstrap>", line 1129, in _exec
150 File "<frozen importlib._bootstrap>", line 1471, in exec_module
151 File "<frozen importlib._bootstrap>", line 321, in _call_with_frames_removed
152 File "/home/temp-drydock/drydock/workingcopy-169/repo/swh-storage/swh/storage/tests/test_storage.py", line 22, in <module>
153 from swh.model import identifiers
154 File "/home/temp-drydock/drydock/workingcopy-169/repo/swh-model/swh/model/identifiers.py", line 10, in <module>
155 from .hashutil import hash_data, hash_git_data
156 File "/home/temp-drydock/drydock/workingcopy-169/repo/swh-model/swh/model/hashutil.py", line 48, in <module>
157 import pyblake2
158ImportError: No module named 'pyblake2'
159
160----------------------------------------------------------------------
161Ran 5 tests in 0.784s
162
163FAILED (errors=5)
164

Update environment from working copy

When
Completed at Mar 21 2017, 3:47 PM · Built for 24 s
Status
Passed
1 empty logs are hidden. Show all logs.

Build Log 3633 (remote - stdout)
25 - 50 - 100 - Unlimited Lines

83 swh/loader/git/loader.py | 49 +++++++++++++++++++++++++++------
84 swh/loader/git/tests/test_converters.py | 3 ++
85 swh/loader/git/updater.py | 48 ++++++++++++++++++++++++++++++++
86 5 files changed, 113 insertions(+), 16 deletions(-)
87
88mr update: /home/temp-drydock/drydock/workingcopy-169/repo/swh-environment/swh-loader-tar
89mr update: /home/temp-drydock/drydock/workingcopy-169/repo/swh-environment/swh-loader-tar
90Already up-to-date.
91
92mr update: /home/temp-drydock/drydock/workingcopy-169/repo/swh-environment/swh-mirror-forge
93mr update: /home/temp-drydock/drydock/workingcopy-169/repo/swh-environment/swh-mirror-forge
94Already up-to-date.
95
96mr update: /home/temp-drydock/drydock/workingcopy-169/repo/swh-environment/swh-loader-svn
97mr update: /home/temp-drydock/drydock/workingcopy-169/repo/swh-environment/swh-loader-svn
98From ssh://forge.softwareheritage.org/diffusion/DLDSVN/swh-loader-svn
99 ffae957..04d7f15 master -> origin/master
100 * [new tag] v0.0.25 -> v0.0.25
101Updating ffae957..04d7f15
102Fast-forward
103 debian/control | 6 ++--
104 requirements-swh.txt | 2 +-
105 swh/loader/svn/converters.py | 48 +--------------------------
106 swh/loader/svn/loader.py | 6 ++--
107 swh/loader/svn/tests/test_converters.py | 58 ---------------------------------
108 swh/loader/svn/tests/test_loader.py | 46 +++++++++++++-------------
109 swh/loader/svn/utils.py | 2 +-
110 7 files changed, 32 insertions(+), 136 deletions(-)
111
112mr update: /home/temp-drydock/drydock/workingcopy-169/repo/swh-environment/swh-model
113mr update: /home/temp-drydock/drydock/workingcopy-169/repo/swh-environment/swh-model
114From ssh://forge.softwareheritage.org/diffusion/DMOD/swh-model
115 3e325ca..a42c75e master -> origin/master
116Updating 3e325ca..a42c75e
117Fast-forward
118 debian/control | 1 +
119 requirements-swh.txt | 1 +
120 swh/model/hashutil.py | 83 ++++++++++++++++++++++++++++------------
121 swh/model/tests/test_hashutil.py | 31 +++++++++++++++
122 4 files changed, 92 insertions(+), 24 deletions(-)
123
124mr update: /home/temp-drydock/drydock/workingcopy-169/repo/swh-environment/swh-objstorage
125mr update: /home/temp-drydock/drydock/workingcopy-169/repo/swh-environment/swh-objstorage
126Already up-to-date.
127
128mr update: /home/temp-drydock/drydock/workingcopy-169/repo/swh-environment/swh-py-template
129mr update: /home/temp-drydock/drydock/workingcopy-169/repo/swh-environment/swh-py-template
130Already up-to-date.
131
132mr update: /home/temp-drydock/drydock/workingcopy-169/repo/swh-environment/swh-scheduler
133mr update: /home/temp-drydock/drydock/workingcopy-169/repo/swh-environment/swh-scheduler
134Already up-to-date.
135
136mr update: /home/temp-drydock/drydock/workingcopy-169/repo/swh-environment/swh-storage-testdata
137mr update: /home/temp-drydock/drydock/workingcopy-169/repo/swh-environment/swh-storage-testdata
138From ssh://forge.softwareheritage.org/diffusion/DSTOT/swh-storage-testdata
139 9211ffa..36ae27d master -> origin/master
140Updating 9211ffa..36ae27d
141Fast-forward
142 dumps/swh-archiver.dump | Bin 18407 -> 20873 bytes
143 dumps/swh-archiver.sql | 88 +++++++++++++++++++++++++++++--
144 dumps/swh.dump | Bin 185669 -> 186008 bytes
145 dumps/swh.sql | 135 +++++++++++++++++++++++++++---------------------
146 4 files changed, 160 insertions(+), 63 deletions(-)
147
148mr update: /home/temp-drydock/drydock/workingcopy-169/repo/swh-environment/swh-storage
149mr update: /home/temp-drydock/drydock/workingcopy-169/repo/swh-environment/swh-storage
150From ssh://forge.softwareheritage.org/diffusion/DSTO/swh-storage
151 cb03a7d..7eabf17 master -> origin/master
152 * [new tag] v0.0.82 -> v0.0.82
153Updating cb03a7d..7eabf17
154Fast-forward
155 sql/swh-func.sql | 50 +++-----
156 sql/swh-schema.sql | 2 +-
157 sql/upgrades/102.sql | 183 +++++++++++++++++++++++++++++
158 swh/storage/db.py | 41 ++++---
159 swh/storage/listener.py | 1 +
160 swh/storage/storage.py | 42 ++++---
161 swh/storage/tests/test_api_client.py | 4 +-
162 swh/storage/tests/test_storage.py | 66 ++++++-----
163 swh/storage/vault/api/cooking_tasks.py | 5 +-
164 swh/storage/vault/api/server.py | 17 ++-
165 swh/storage/vault/cookers/base.py | 44 +++----
166 swh/storage/vault/cookers/directory.py | 4 +-
167 swh/storage/vault/cookers/revision_flat.py | 9 +-
168 swh/storage/vault/cookers/revision_git.py | 34 ++++--
169 14 files changed, 344 insertions(+), 158 deletions(-)
170 create mode 100644 sql/upgrades/102.sql
171
172mr update: /home/temp-drydock/drydock/workingcopy-169/repo/swh-environment/swh-web-ui
173mr update: /home/temp-drydock/drydock/workingcopy-169/repo/swh-environment/swh-web-ui
174From ssh://forge.softwareheritage.org/diffusion/DWUI/swh-web-ui
175 dfbb949..67b1cf5 master -> origin/master
176Updating dfbb949..67b1cf5
177Fast-forward
178 swh/web/ui/views/browse.py | 4 ----
179 1 file changed, 4 deletions(-)
180
181mr update: finished (24 ok)
182

Clone on Software Heritage Worker

When
Completed at Mar 21 2017, 3:47 PM · Built instantly
Status
Passed

Event Timeline